Test: /ext/standard/tests/strings/setlocale_variation2.phpt - Version 5.5.14    

There are 21 different diffs reported by users for this test.

Count Diff
166 (66%)
006+ Test FAILED
007+ Names of locale() for which setlocale() failed ...
008+ array(1) {
009+ [0]=>
010+ string(16) "no_NO.ISO-8859-1"
011+ }
006- Test PASSED
23 (9%)
006+ Test FAILED
007+ Names of locale() for which setlocale() failed ...
008+ array(1) {
009+ [0]=>
010+ string(14) "hy_AM.armscii8"
011+ }
006- Test PASSED
16 (6%)
006+ Test FAILED
007+ Names of locale() for which setlocale() failed ...
008+ array(2) {
009+ [0]=>
010+ string(14) "hy_AM.armscii8"
011+ [1]=>
012+ string(19) "ja_JP.shiftjisx0213"
013+ }
006- Test PASSED
8 (3%)
006+ Test FAILED
007+ Names of locale() for which setlocale() failed ...
006- Test PASSED
007- Done
008+ array(6) {
009+ [0]=>
010+ string(15) "la_LN.ISO8859-1"
011+ [1]=>
012+ string(16) "la_LN.ISO8859-13"
013+ [2]=>
014+ string(16) "la_LN.ISO8859-15"
015+ [3]=>
016+ string(15) "la_LN.ISO8859-2"
017+ [4]=>
018+ string(15) "la_LN.ISO8859-4"
019+ [5]=>
020+ string(14) "la_LN.US-ASCII"
021+ }
022+ Done
7 (3%)
002+ locale: Cannot set LC_CTYPE to default locale: No such file or directory
003+ locale: Cannot set LC_MESSAGES to default locale: No such file or directory
004+ locale: Cannot set LC_COLLATE to default locale: No such file or directory
006- Test PASSED
009+ Test FAILED
010+ Names of locale() for which setlocale() failed ...
011+ array(1) {
012+ [0]=>
013+ string(0) ""
014+ }
7 (3%)
006+ Test FAILED
007+ Names of locale() for which setlocale() failed ...
008+ array(1) {
009+ [0]=>
010+ string(10) "de_CH.utf8"
011+ }
006- Test PASSED
4 (2%)
006+ Test FAILED
007+ Names of locale() for which setlocale() failed ...
006- Test PASSED
007- Done
008+ array(5) {
009+ [0]=>
010+ string(15) "la_LN.ISO8859-1"
011+ [1]=>
012+ string(16) "la_LN.ISO8859-15"
013+ [2]=>
014+ string(15) "la_LN.ISO8859-2"
015+ [3]=>
016+ string(15) "la_LN.ISO8859-4"
017+ [4]=>
018+ string(14) "la_LN.US-ASCII"
019+ }
020+ Done
2 (1%)
2 (1%)
002+ locale: Cannot set LC_CTYPE to default locale: No such file or directory
003+ locale: Cannot set LC_MESSAGES to default locale: No such file or directory
004+ locale: Cannot set LC_COLLATE to default locale: No such file or directory
006- Test PASSED
009+ Test FAILED
010+ Names of locale() for which setlocale() failed ...
011+ array(2) {
012+ [0]=>
013+ string(16) "no_NO.ISO-8859-1"
014+ [1]=>
015+ string(0) ""
016+ }
2 (1%)
002+ locale: Cannot set LC_CTYPE to default locale: No such file or directory
006- Test PASSED
007+ Test FAILED
008+ Names of locale() for which setlocale() failed ...
009+ array(1) {
010+ [0]=>
011+ string(0) ""
012+ }
2 (1%)
003+
004+ ** ERROR: process timed out **
003- No of locales found on the machine = %d
004- No of setlocale() success = %d
005- Expected no of failures = 0
006- Test PASSED
007- Done
2 (1%)
006+ Test FAILED
007+ Names of locale() for which setlocale() failed ...
006- Test PASSED
007- Done
008+ array(5) {
009+ [0]=>
010+ string(10) "iso_8859_1"
011+ [1]=>
012+ string(16) "ko_KR.UTF-8@dict"
013+ [2]=>
014+ string(18) "zh_CN.UTF-8@pinyin"
015+ [3]=>
016+ string(19) "zh_CN.UTF-8@radical"
017+ [4]=>
018+ string(18) "zh_CN.UTF-8@stroke"
019+ }
020+ Done
2 (1%)
006+ Test FAILED
007+ Names of locale() for which setlocale() failed ...
008+ array(1) {
009+ [0]=>
010+ string(19) "ja_JP.shiftjisx0213"
011+ }
006- Test PASSED
1 (0%)
006+ Test FAILED
007+ Names of locale() for which setlocale() failed ...
006- Test PASSED
007- Done
008+ array(28) {
009+ [0]=>
010+ string(10) "cs_CZ.utf8"
011+ [1]=>
012+ string(5) "de_DE"
013+ [2]=>
014+ string(14) "de_DE.iso88591"
015+ [3]=>
016+ string(20) "de_DE.iso885915@euro"
017+ [4]=>
018+ string(10) "de_DE.utf8"
019+ [5]=>
020+ string(10) "de_DE@euro"
021+ [6]=>
022+ string(5) "en_HK"
023+ [7]=>
024+ string(14) "en_HK.iso88591"
025+ [8]=>
026+ string(5) "en_PH"
027+ [9]=>
028+ string(14) "en_PH.iso88591"
029+ [10]=>
030+ string(5) "en_US"
031+ [11]=>
032+ string(14) "en_US.iso88591"
033+ [12]=>
034+ string(10) "en_US.utf8"
035+ [13]=>
036+ string(5) "es_MX"
037+ [14]=>
038+ string(14) "es_MX.iso88591"
039+ [15]=>
040+ string(5) "fa_IR"
041+ [16]=>
042+ string(10) "fa_IR.utf8"
043+ [17]=>
044+ string(5) "fr_FR"
045+ [18]=>
046+ string(14) "fr_FR.iso88591"
047+ [19]=>
048+ string(20) "fr_FR.iso885915@euro"
049+ [20]=>
050+ string(10) "fr_FR.utf8"
051+ [21]=>
052+ string(10) "fr_FR@euro"
053+ [22]=>
054+ string(5) "it_IT"
055+ [23]=>
056+ string(14) "it_IT.iso88591"
057+ [24]=>
058+ string(5) "ja_JP"
059+ [25]=>
060+ string(11) "ja_JP.eucjp"
061+ [26]=>
062+ string(10) "tr_TR.utf8"
063+ [27]=>
064+ string(13) "zh_CN.gb18030"
065+ }
066+ Done
1 (0%)
006+ Test FAILED
007+ Names of locale() for which setlocale() failed ...
006- Test PASSED
007- Done
008+ array(6) {
009+ [0]=>
010+ string(15) "la_LN.ISO8859-1"
011+ [1]=>
012+ string(16) "la_LN.ISO8859-15"
013+ [2]=>
014+ string(15) "la_LN.ISO8859-2"
015+ [3]=>
016+ string(15) "la_LN.ISO8859-4"
017+ [4]=>
018+ string(14) "la_LN.US-ASCII"
019+ [5]=>
020+ string(15) "lt_LT.ISO8859-4"
021+ }
022+ Done
1 (0%)
006+ Test FAILED
007+ Names of locale() for which setlocale() failed ...
008+ array(1) {
009+ [0]=>
010+ string(0) ""
011+ }
006- Test PASSED
1 (0%)
006+ Test FAILED
007+ Names of locale() for which setlocale() failed ...
008+ array(1) {
009+ [0]=>
010+ string(10) "en_HK.utf8"
011+ }
006- Test PASSED
1 (0%)
006+ Test FAILED
007+ Names of locale() for which setlocale() failed ...
008+ array(1) {
009+ [0]=>
010+ string(10) "es_CU.utf8"
011+ }
006- Test PASSED
1 (0%)
006+ Test FAILED
007+ Names of locale() for which setlocale() failed ...
008+ array(1) {
009+ [0]=>
010+ string(14) "ja_JP.JISX0213"
011+ }
006- Test PASSED
1 (0%)
006+ Test FAILED
007+ Names of locale() for which setlocale() failed ...
008+ array(1) {
009+ [0]=>
010+ string(16) "nb_NO.ISO-8859-1"
011+ }
006- Test PASSED
1 (0%)
006+ Test FAILED
007+ Names of locale() for which setlocale() failed ...
008+ array(3) {
009+ [0]=>
010+ string(2) "es"
011+ [1]=>
012+ string(2) "fr"
013+ [2]=>
014+ string(10) "iso_8859_1"
015+ }
006- Test PASSED