Test: /ext/standard/tests/strings/setlocale_variation2.phpt - Version 5.5.28    

There are 10 different diffs reported by users for this test.

Count Diff
17 (40%)
006+ Test FAILED
007+ Names of locale() for which setlocale() failed ...
008+ array(1) {
009+ [0]=>
010+ string(16) "no_NO.ISO-8859-1"
011+ }
006- Test PASSED
7 (16%)
006+ Test FAILED
007+ Names of locale() for which setlocale() failed ...
008+ array(2) {
009+ [0]=>
010+ string(14) "hy_AM.armscii8"
011+ [1]=>
012+ string(19) "ja_JP.shiftjisx0213"
013+ }
006- Test PASSED
6 (14%)
006+ Test FAILED
007+ Names of locale() for which setlocale() failed ...
008+ array(1) {
009+ [0]=>
010+ string(14) "hy_AM.armscii8"
011+ }
006- Test PASSED
5 (12%)
006+ Test FAILED
007+ Names of locale() for which setlocale() failed ...
006- Test PASSED
007- Done
008+ array(6) {
009+ [0]=>
010+ string(15) "la_LN.ISO8859-1"
011+ [1]=>
012+ string(16) "la_LN.ISO8859-13"
013+ [2]=>
014+ string(16) "la_LN.ISO8859-15"
015+ [3]=>
016+ string(15) "la_LN.ISO8859-2"
017+ [4]=>
018+ string(15) "la_LN.ISO8859-4"
019+ [5]=>
020+ string(14) "la_LN.US-ASCII"
021+ }
022+ Done
2 (5%)
002+ locale: Cannot set LC_CTYPE to default locale: No such file or directory
006- Test PASSED
007+ Test FAILED
008+ Names of locale() for which setlocale() failed ...
009+ array(1) {
010+ [0]=>
011+ string(0) ""
012+ }
2 (5%)
006+ Test FAILED
007+ Names of locale() for which setlocale() failed ...
008+ array(1) {
009+ [0]=>
010+ string(10) "zh_CN.utf8"
011+ }
006- Test PASSED
1 (2%)
1 (2%)
002+ locale: Cannot set LC_CTYPE to default locale: No such file or directory
003+ locale: Cannot set LC_MESSAGES to default locale: No such file or directory
004+ locale: Cannot set LC_COLLATE to default locale: No such file or directory
006- Test PASSED
009+ Test FAILED
010+ Names of locale() for which setlocale() failed ...
011+ array(1) {
012+ [0]=>
013+ string(0) ""
014+ }
1 (2%)
006+ Test FAILED
007+ Names of locale() for which setlocale() failed ...
008+ array(1) {
009+ [0]=>
010+ string(10) "de_CH.utf8"
011+ }
006- Test PASSED
1 (2%)
006+ Test FAILED
007+ Names of locale() for which setlocale() failed ...
008+ array(1) {
009+ [0]=>
010+ string(10) "so_SO.utf8"
011+ }
006- Test PASSED