Test: /ext/standard/tests/strings/setlocale_variation2.phpt - Version 7.0.0RC1    

There are 11 different diffs reported by users for this test.

Count Diff
6 (26%)
006+ Test FAILED
007+ Names of locale() for which setlocale() failed ...
006- Test PASSED
007- Done
008+ array(6) {
009+ [0]=>
010+ string(15) "la_LN.ISO8859-1"
011+ [1]=>
012+ string(16) "la_LN.ISO8859-13"
013+ [2]=>
014+ string(16) "la_LN.ISO8859-15"
015+ [3]=>
016+ string(15) "la_LN.ISO8859-2"
017+ [4]=>
018+ string(15) "la_LN.ISO8859-4"
019+ [5]=>
020+ string(14) "la_LN.US-ASCII"
021+ }
022+ Done
4 (17%)
006+ Test FAILED
007+ Names of locale() for which setlocale() failed ...
008+ array(1) {
009+ [0]=>
010+ string(14) "hy_AM.armscii8"
011+ }
006- Test PASSED
4 (17%)
006+ Test FAILED
007+ Names of locale() for which setlocale() failed ...
008+ array(2) {
009+ [0]=>
010+ string(14) "hy_AM.armscii8"
011+ [1]=>
012+ string(19) "ja_JP.shiftjisx0213"
013+ }
006- Test PASSED
2 (9%)
006+ Test FAILED
007+ Names of locale() for which setlocale() failed ...
008+ array(1) {
009+ [0]=>
010+ string(10) "es_CU.utf8"
011+ }
006- Test PASSED
1 (4%)
1 (4%)
002+ locale: Cannot set LC_CTYPE to default locale: No such file or directory
006- Test PASSED
007+ Test FAILED
008+ Names of locale() for which setlocale() failed ...
009+ array(1) {
010+ [0]=>
011+ string(0) ""
012+ }
1 (4%)
006+ Test FAILED
007+ Names of locale() for which setlocale() failed ...
006- Test PASSED
007- Done
008+ array(7) {
009+ [0]=>
010+ string(16) "la_LN.ISO8859-15"
011+ [1]=>
012+ string(16) "la_LN.ISO8859-13"
013+ [2]=>
014+ string(15) "la_LN.ISO8859-2"
015+ [3]=>
016+ string(15) "la_LN.ISO8859-4"
017+ [4]=>
018+ string(5) "UTF-8"
019+ [5]=>
020+ string(14) "la_LN.US-ASCII"
021+ [6]=>
022+ string(15) "la_LN.ISO8859-1"
023+ }
024+ Done 017372: 1441875127 0.52527700 < 1441875127 0.52527800 038099: 1441875127 0.54528200 < 1441875127 0.54528300 048454: 1441875127 0.55527400 < 1441875127 0.55527500 079462: 1441875127 0.58527200 < 1441875127 0.58527400 089839: 1441875127 0.59526500 < 1441875127 0.59526700 001+ Passed: 99995
002+ Failed: 5
001- Passed: 100000
002- Failed: 0
003+ 017372: 1441875127 0.52527700 < 1441875127 0.52527800
004+ 038099: 1441875127 0.54528200 < 1441875127 0.54528300
005+ 048454: 1441875127 0.55527400 < 1441875127 0.55527500
006+ 079462: 1441875127 0.58527200 < 1441875127 0.58527400
007+ 089839: 1441875127 0.59526500 < 1441875127 0.59526700
1 (4%)
006+ Test FAILED
007+ Names of locale() for which setlocale() failed ...
008+ array(1) {
009+ [0]=>
010+ string(0) ""
011+ }
006- Test PASSED
1 (4%)
006+ Test FAILED
007+ Names of locale() for which setlocale() failed ...
008+ array(1) {
009+ [0]=>
010+ string(10) "de_CH.utf8"
011+ }
006- Test PASSED
1 (4%)
006+ Test FAILED
007+ Names of locale() for which setlocale() failed ...
008+ array(1) {
009+ [0]=>
010+ string(10) "es_PY.utf8"
011+ }
006- Test PASSED
1 (4%)
006+ Test FAILED
007+ Names of locale() for which setlocale() failed ...
008+ array(1) {
009+ [0]=>
010+ string(10) "es_SV.utf8"
011+ }
006- Test PASSED