Test: /ext/standard/tests/strings/setlocale_variation2.phpt - Version 7.0.11    

There are 10 different diffs reported by users for this test.

Count Diff
40 (40%)
002+ sh: locale: not found
21 (21%)
006+ Test FAILED
007+ Names of locale() for which setlocale() failed ...
008+ array(2) {
009+ [0]=>
010+ string(14) "hy_AM.armscii8"
011+ [1]=>
012+ string(19) "ja_JP.shiftjisx0213"
013+ }
006- Test PASSED
20 (20%)
006+ Test FAILED
007+ Names of locale() for which setlocale() failed ...
008+ array(1) {
009+ [0]=>
010+ string(14) "hy_AM.armscii8"
011+ }
006- Test PASSED
5 (5%)
006+ Test FAILED
007+ Names of locale() for which setlocale() failed ...
006- Test PASSED
007- Done
008+ array(6) {
009+ [0]=>
010+ string(15) "la_LN.ISO8859-1"
011+ [1]=>
012+ string(16) "la_LN.ISO8859-13"
013+ [2]=>
014+ string(16) "la_LN.ISO8859-15"
015+ [3]=>
016+ string(15) "la_LN.ISO8859-2"
017+ [4]=>
018+ string(15) "la_LN.ISO8859-4"
019+ [5]=>
020+ string(14) "la_LN.US-ASCII"
021+ }
022+ Done
4 (4%)
002+ locale: Cannot set LC_CTYPE to default locale: No such file or directory
003+ locale: Cannot set LC_MESSAGES to default locale: No such file or directory
004+ locale: Cannot set LC_COLLATE to default locale: No such file or directory
006- Test PASSED
009+ Test FAILED
010+ Names of locale() for which setlocale() failed ...
011+ array(1) {
012+ [0]=>
013+ string(0) ""
014+ }
3 (3%)
002+ locale: Cannot set LC_CTYPE to default locale: No such file or directory
006- Test PASSED
007+ Test FAILED
008+ Names of locale() for which setlocale() failed ...
009+ array(1) {
010+ [0]=>
011+ string(0) ""
012+ }
3 (3%)
006+ Test FAILED
007+ Names of locale() for which setlocale() failed ...
006- Test PASSED
007- Done
008+ array(10) {
009+ [0]=>
010+ string(11) "crh_UA.utf8"
011+ [1]=>
012+ string(10) "de_CH.utf8"
013+ [2]=>
014+ string(5) "dz_BT"
015+ [3]=>
016+ string(10) "ks_IN.utf8"
017+ [4]=>
018+ string(10) "lg_UG.utf8"
019+ [5]=>
020+ string(10) "rw_RW.utf8"
021+ [6]=>
022+ string(10) "ta_IN.utf8"
023+ [7]=>
024+ string(14) "uz_UZ@cyrillic"
025+ [8]=>
026+ string(10) "uz_UZ.utf8"
027+ [9]=>
028+ string(10) "vi_VN.utf8"
029+ }
030+ Done
2 (2%)
1 (1%)
006+ Test FAILED
007+ Names of locale() for which setlocale() failed ...
008+ array(1) {
009+ [0]=>
010+ string(0) ""
011+ }
006- Test PASSED
1 (1%)
006+ Test FAILED
007+ Names of locale() for which setlocale() failed ...
008+ array(1) {
009+ [0]=>
010+ string(10) "es_CU.utf8"
011+ }
006- Test PASSED