Test: /ext/standard/tests/strings/setlocale_variation2.phpt - Version 5.3.20    

There are 11 different diffs reported by users for this test.

Count Diff
10 (23%)
006+ Test FAILED
007+ Names of locale() for which setlocale() failed ...
006- Test PASSED
007- Done
008+ array(6) {
009+ [0]=>
010+ string(15) "la_LN.ISO8859-1"
011+ [1]=>
012+ string(16) "la_LN.ISO8859-13"
013+ [2]=>
014+ string(16) "la_LN.ISO8859-15"
015+ [3]=>
016+ string(15) "la_LN.ISO8859-2"
017+ [4]=>
018+ string(15) "la_LN.ISO8859-4"
019+ [5]=>
020+ string(14) "la_LN.US-ASCII"
021+ }
022+ Done
9 (20%)
006+ Test FAILED
007+ Names of locale() for which setlocale() failed ...
008+ array(1) {
009+ [0]=>
010+ string(14) "hy_AM.armscii8"
011+ }
006- Test PASSED
6 (14%)
006+ Test FAILED
007+ Names of locale() for which setlocale() failed ...
008+ array(2) {
009+ [0]=>
010+ string(14) "hy_AM.armscii8"
011+ [1]=>
012+ string(19) "ja_JP.shiftjisx0213"
013+ }
006- Test PASSED
5 (11%)
006+ Test FAILED
007+ Names of locale() for which setlocale() failed ...
006- Test PASSED
007- Done
008+ array(5) {
009+ [0]=>
010+ string(15) "la_LN.ISO8859-1"
011+ [1]=>
012+ string(16) "la_LN.ISO8859-15"
013+ [2]=>
014+ string(15) "la_LN.ISO8859-2"
015+ [3]=>
016+ string(15) "la_LN.ISO8859-4"
017+ [4]=>
018+ string(14) "la_LN.US-ASCII"
019+ }
020+ Done
4 (9%)
002+ locale: Cannot set LC_CTYPE to default locale: No such file or directory
006- Test PASSED
007+ Test FAILED
008+ Names of locale() for which setlocale() failed ...
009+ array(1) {
010+ [0]=>
011+ string(0) ""
012+ }
3 (7%)
006+ Test FAILED
007+ Names of locale() for which setlocale() failed ...
008+ array(1) {
009+ [0]=>
010+ string(16) "no_NO.ISO-8859-1"
011+ }
006- Test PASSED
2 (5%)
006+ Test FAILED
007+ Names of locale() for which setlocale() failed ...
008+ array(1) {
009+ [0]=>
010+ string(10) "iso_8859_1"
011+ }
006- Test PASSED
2 (5%)
006+ Test FAILED
007+ Names of locale() for which setlocale() failed ...
008+ array(3) {
009+ [0]=>
010+ string(2) "es"
011+ [1]=>
012+ string(2) "fr"
013+ [2]=>
014+ string(10) "iso_8859_1"
015+ }
006- Test PASSED
1 (2%)
002+ sh: locale: not found
1 (2%)
006+ Test FAILED
007+ Names of locale() for which setlocale() failed ...
008+ array(1) {
009+ [0]=>
010+ string(10) "de_CH.utf8"
011+ }
006- Test PASSED
1 (2%)
006+ Test FAILED
007+ Names of locale() for which setlocale() failed ...
008+ array(1) {
009+ [0]=>
010+ string(19) "ja_JP.shiftjisx0213"
011+ }
006- Test PASSED