Test: /ext/standard/tests/strings/setlocale_variation2.phpt - Version 5.6.15    

There are 16 different diffs reported by users for this test.

Count Diff
43 (40%)
006+ Test FAILED
007+ Names of locale() for which setlocale() failed ...
008+ array(1) {
009+ [0]=>
010+ string(14) "hy_AM.armscii8"
011+ }
006- Test PASSED
31 (29%)
006+ Test FAILED
007+ Names of locale() for which setlocale() failed ...
008+ array(2) {
009+ [0]=>
010+ string(14) "hy_AM.armscii8"
011+ [1]=>
012+ string(19) "ja_JP.shiftjisx0213"
013+ }
006- Test PASSED
9 (8%)
006+ Test FAILED
007+ Names of locale() for which setlocale() failed ...
006- Test PASSED
007- Done
008+ array(6) {
009+ [0]=>
010+ string(15) "la_LN.ISO8859-1"
011+ [1]=>
012+ string(16) "la_LN.ISO8859-13"
013+ [2]=>
014+ string(16) "la_LN.ISO8859-15"
015+ [3]=>
016+ string(15) "la_LN.ISO8859-2"
017+ [4]=>
018+ string(15) "la_LN.ISO8859-4"
019+ [5]=>
020+ string(14) "la_LN.US-ASCII"
021+ }
022+ Done
7 (6%)
002+ locale: Cannot set LC_CTYPE to default locale: No such file or directory
006- Test PASSED
007+ Test FAILED
008+ Names of locale() for which setlocale() failed ...
009+ array(1) {
010+ [0]=>
011+ string(0) ""
012+ }
3 (3%)
006+ Test FAILED
007+ Names of locale() for which setlocale() failed ...
008+ array(1) {
009+ [0]=>
010+ string(10) "de_CH.utf8"
011+ }
006- Test PASSED
2 (2%)
2 (2%)
002+ locale: Cannot set LC_CTYPE to default locale: No such file or directory
003+ locale: Cannot set LC_MESSAGES to default locale: No such file or directory
004+ locale: Cannot set LC_COLLATE to default locale: No such file or directory
006- Test PASSED
009+ Test FAILED
010+ Names of locale() for which setlocale() failed ...
011+ array(1) {
012+ [0]=>
013+ string(0) ""
014+ }
2 (2%)
002+ sh: locale: command not found
2 (2%)
006+ Test FAILED
007+ Names of locale() for which setlocale() failed ...
008+ array(2) {
009+ [0]=>
010+ string(14) "hy_AM.armscii8"
011+ [1]=>
012+ string(10) "no_NO.utf8"
013+ }
006- Test PASSED
1 (1%)
002+ locale: Cannot set LC_CTYPE to default locale: No such file or directory
003+ locale: Cannot set LC_MESSAGES to default locale: No such file or directory
004+ locale: Cannot set LC_COLLATE to default locale: No such file or directory
006- Test PASSED
009+ Test FAILED
010+ Names of locale() for which setlocale() failed ...
011+ array(3) {
012+ [0]=>
013+ string(14) "hy_AM.armscii8"
014+ [1]=>
015+ string(19) "ja_JP.shiftjisx0213"
016+ [2]=>
017+ string(0) ""
018+ }
1 (1%)
002+ locale: Cannot set LC_CTYPE to default locale: No such file or directory
006- Test PASSED
007+ Test FAILED
008+ Names of locale() for which setlocale() failed ...
009+ array(2) {
010+ [0]=>
011+ string(14) "hy_AM.armscii8"
012+ [1]=>
013+ string(0) ""
014+ }
1 (1%)
006+ Test FAILED
007+ Names of locale() for which setlocale() failed ...
006- Test PASSED
007- Done
008+ array(24) {
009+ [0]=>
010+ string(5) "az_AZ"
011+ [1]=>
012+ string(5) "bn_IN"
013+ [2]=>
014+ string(11) "crh_UA.utf8"
015+ [3]=>
016+ string(10) "da_DK.utf8"
017+ [4]=>
018+ string(5) "dz_BT"
019+ [5]=>
020+ string(10) "hy_AM.utf8"
021+ [6]=>
022+ string(10) "ka_GE.utf8"
023+ [7]=>
024+ string(10) "ks_IN.utf8"
025+ [8]=>
026+ string(10) "kw_GB.utf8"
027+ [9]=>
028+ string(5) "li_BE"
029+ [10]=>
030+ string(5) "lo_LA"
031+ [11]=>
032+ string(10) "lt_LT.utf8"
033+ [12]=>
034+ string(6) "mai_IN"
035+ [13]=>
036+ string(5) "mn_MN"
037+ [14]=>
038+ string(10) "ps_AF.utf8"
039+ [15]=>
040+ string(10) "rw_RW.utf8"
041+ [16]=>
042+ string(5) "sd_IN"
043+ [17]=>
044+ string(10) "sd_PK.utf8"
045+ [18]=>
046+ string(10) "ta_IN.utf8"
047+ [19]=>
048+ string(10) "uz_UZ.utf8"
049+ [20]=>
050+ string(14) "uz_UZ@cyrillic"
051+ [21]=>
052+ string(10) "vi_VN.utf8"
053+ [22]=>
054+ string(5) "wo_SN"
055+ [23]=>
056+ string(10) "zh_TW.utf8"
057+ }
058+ Done
1 (1%)
006+ Test FAILED
007+ Names of locale() for which setlocale() failed ...
008+ array(1) {
009+ [0]=>
010+ string(0) ""
011+ }
006- Test PASSED
1 (1%)
006+ Test FAILED
007+ Names of locale() for which setlocale() failed ...
008+ array(1) {
009+ [0]=>
010+ string(10) "es_CL.utf8"
011+ }
006- Test PASSED
1 (1%)
006+ Test FAILED
007+ Names of locale() for which setlocale() failed ...
008+ array(1) {
009+ [0]=>
010+ string(10) "iso_8859_1"
011+ }
006- Test PASSED
1 (1%)
006+ Test FAILED
007+ Names of locale() for which setlocale() failed ...
008+ array(1) {
009+ [0]=>
010+ string(19) "ja_JP.shiftjisx0213"
011+ }
006- Test PASSED